BDBM255272 US9481682, 21
SMILES CC(F)(F)c1ccnc(NC(=O)c2ccc(-c3nc([C@@H]4CC[C@H]5CCC(=O)N5C4)n4ccnc(N)c34)c(F)c2)c1
InChI Key InChIKey=RMVJIMSRMZGECB-AEFFLSMTSA-N
Data  1 IC50
  Tab Delimited (TSV)   2D SDfile   Computed 3D by Vconf -m prep SDfile
Find this compound or compounds like it in BindingDB:
Activity Spreadsheet -- Enzyme Inhibition Constant Data from BindingDB
Found 1 hit for monomerid = 255272
TargetTyrosine-protein kinase BTK(Homo sapiens (Human))
Merck Sharp & Dohme
US Patent
LigandPNGBDBM255272(US9481682, 21)
Affinity DataIC50:  0.210nM. Assay description: BTK enzymatic activity was determined with the LANCE (Lanthanide Chelate Excite) TR-FRET (Time-resolved fluorescence resonance energy transfer) assay...
Ligand InfoPC cidPC sid
In DepthDetails US Patent