BDBM256277 US9487488, 1
SMILES FC(F)(F)Oc1ccc(CN(c2ncc3ccccc3c2C2CC2)S(=O)(=O)c2ccc(cc2)-c2nnn[nH]2)cc1
InChI Key InChIKey=HLLKNPAVDRASLS-UHFFFAOYSA-N
Data  2 IC50
  Tab Delimited (TSV)   2D SDfile   Computed 3D by Vconf -m prep SDfile
Find this compound or compounds like it in BindingDB:
Activity Spreadsheet -- Enzyme Inhibition Constant Data from BindingDB
Found 2 hits for monomerid = 256277
LigandPNGBDBM256277(US9487488, 1)
Affinity DataIC50:  0.300nM. Assay description: Antagonist activity at TRPM8 (unknown origin)
Ligand InfoPC cidPC sid
In DepthDetails PubMed
LigandPNGBDBM256277(US9487488, 1)
Affinity DataIC50:  0.300nMT: 2°C. Assay description: The functional activity of a test compound was determined by measuring change in intracellular calcium concentration using a calcium sensitive fluore...
Ligand InfoPC cidPC sid
In DepthDetails US Patent