BDBM256283 US9487488, 7
SMILES FC(F)(F)Oc1ccc(CN(c2ncc3ccccc3c2C2CC2)S(=O)(=O)c2ccc(cc2)-c2noc(=O)[nH]2)cc1
InChI Key InChIKey=OJSOCWUQIASHOS-UHFFFAOYSA-N
Data  1 IC50
  Tab Delimited (TSV)   2D SDfile   Computed 3D by Vconf -m prep SDfile
Find this compound or compounds like it in BindingDB:
Activity Spreadsheet -- Enzyme Inhibition Constant Data from BindingDB
Found 1 hit for monomerid = 256283
TargetTransient receptor potential cation channel subfamily M member 8(Homo sapiens (Human))
Mitsubishi Tanabe Pharma
US Patent
LigandPNGBDBM256283(US9487488, 7)
Affinity DataIC50:  1nMT: 2°C. Assay description: The functional activity of a test compound was determined by measuring change in intracellular calcium concentration using a calcium sensitive fluore...
Ligand InfoPC cidPC sid
In DepthDetails US Patent