BDBM256314 US9487488, 38
SMILES Cc1cc(ccc1S(=O)(=O)N(Cc1ccc(OC(F)(F)F)cc1)c1ncc2ccccc2c1C1CC1)C(O)=O
InChI Key InChIKey=BQXRJPCGDGMUFY-UHFFFAOYSA-N
Data  1 IC50
  Tab Delimited (TSV)   2D SDfile   Computed 3D by Vconf -m prep SDfile
Find this compound or compounds like it in BindingDB:
Activity Spreadsheet -- Enzyme Inhibition Constant Data from BindingDB
Found 1 hit for monomerid = 256314
TargetTransient receptor potential cation channel subfamily M member 8(Homo sapiens (Human))
Mitsubishi Tanabe Pharma
US Patent
LigandPNGBDBM256314(US9487488, 38)
Affinity DataIC50:  0.700nMT: 2°C. Assay description: The functional activity of a test compound was determined by measuring change in intracellular calcium concentration using a calcium sensitive fluore...
Ligand InfoPC cidPC sid
In DepthDetails US Patent