BDBM26046 (1E)-5-[2-(morpholin-4-ylmethyl)-5-(pyridin-4-yl)-1H-imidazol-4-yl]-2,3-dihydro-1H-indene-1-hydroxylamine::imidazole-based compound, 7
SMILES O=NC1CCc2cc(ccc12)-c1[nH]c(CN2CCOCC2)nc1-c1ccncc1
InChI Key InChIKey=VMHUMZQLFVVMEX-UHFFFAOYSA-N
Data  1 Kd
  Tab Delimited (TSV)   2D SDfile   Computed 3D by Vconf -m prep SDfile
Find this compound or compounds like it in BindingDB:
Activity Spreadsheet -- Enzyme Inhibition Constant Data from BindingDB
Found 1 hit for monomerid = 26046
TargetSerine/threonine-protein kinase B-raf(Homo sapiens (Human))
Gsk
LigandPNGBDBM26046((1E)-5-[2-(morpholin-4-ylmethyl)-5-(pyridin-4-yl)-...)
Affinity DataKd:  15.8nMpH: 7.5 T: 2°C. Assay description: The kinase enzyme, fluorescent ligand and a variable concentration of test compound are incubated together to reach thermodynamic equilibrium under c...
In DepthDetails ArticlePubMed