BDBM26052 [2-(4-{5-[(1E)-1-(hydroxyimino)-2,3-dihydro-1H-inden-5-yl]-4-(pyridin-4-yl)-1H-pyrrol-2-yl}phenoxy)ethyl]dimethylamine::pyrrole-based compound, 13
SMILES CN(C)CCOc1ccc(cc1)-c1cc(c([nH]1)-c1ccc2C(CCc2c1)N=O)-c1ccncc1
InChI Key InChIKey=ZAGZDPPXYNVHHN-UHFFFAOYSA-N
Data  1 Kd
  Tab Delimited (TSV)   2D SDfile   Computed 3D by Vconf -m prep SDfile
Find this compound or compounds like it in BindingDB:
Activity Spreadsheet -- Enzyme Inhibition Constant Data from BindingDB
Found 1 hit for monomerid = 26052
TargetSerine/threonine-protein kinase B-raf(Homo sapiens (Human))
Gsk
LigandPNGBDBM26052([2-(4-{5-[(1E)-1-(hydroxyimino)-2,3-dihydro-1H-ind...)
Affinity DataKd:  2.40nMpH: 7.5 T: 2°C. Assay description: The kinase enzyme, fluorescent ligand and a variable concentration of test compound are incubated together to reach thermodynamic equilibrium under c...
In DepthDetails ArticlePubMed