BDBM261305 US10092570, Example 340::US10376513, Example 334::US10646492, Example 334::US9707233, 334::US9730939, Example 334
SMILES CCOc1c(cc(Cl)c(C#N)c1-c1ccnc(c1)C(=O)N(C)C)C(C)n1nc(C)c2c(N)ncnc12
InChI Key InChIKey=BJDVQZKDMAKKPM-UHFFFAOYSA-N
Data  5 IC50
  Tab Delimited (TSV)   2D SDfile   Computed 3D by Vconf -m prep SDfile
Find this compound or compounds like it in BindingDB:
Activity Spreadsheet -- Enzyme Inhibition Constant Data from BindingDB
Found 1 hit for monomerid = 261305
TargetPhosphatidylinositol 4,5-bisphosphate 3-kinase catalytic subunit delta isoform(Homo sapiens (Human))
Incyte Holdings
US Patent
LigandPNGBDBM261305(US10092570, Example 340 | US10376513, Example 334 ...)
Affinity DataIC50: <10nM. Assay description: [γ-33P]ATP (10 mCi/mL) was purchased from Perkin-Elmer (Waltham, Mass.). Lipid kinase substrate, D-myo-Phosphatidylinositol 4,5-bisphosphate (Pt...
Ligand InfoPC cidPC sid
In DepthDetails US Patent