BDBM261330 US10092570, Example 352::US9707233, 350
SMILES CCOc1c(cc(Cl)c(C#N)c1C1CNC(=O)C1)[C@H](C)n1nc(C)c2c(N)ncnc12
InChI Key InChIKey=IIEKNYURGTYVMT-PXYINDEMSA-N
Data  3 IC50
  Tab Delimited (TSV)   2D SDfile   Computed 3D by Vconf -m prep SDfile
Find this compound or compounds like it in BindingDB:
Activity Spreadsheet -- Enzyme Inhibition Constant Data from BindingDB
Found 3 hits for monomerid = 261330
LigandPNGBDBM261330(US10092570, Example 352 | US9707233, 350)
Affinity DataIC50: >500nMpH: 6.7 T: 2°C. Assay description: Lipid kinase substrate, phosphoinositol-4,5-bisphosphate (PIP2), are purchased from Echelon Biosciences (Salt Lake City, Utah). PI3K isoforms α,...
Ligand InfoPC cidPC sid
In DepthDetails US Patent
LigandPNGBDBM261330(US10092570, Example 352 | US9707233, 350)
Affinity DataIC50: <1nM. Assay description: Inhibition of PI3Kdelta (unknown origin) using D-myophosphatidylinositol 4,5-bisphosphate as substrate incubated for 120 mins by [gamma-33P]ATP based...
Ligand InfoPC cidPC sid
In DepthDetails ArticlePubMed
LigandPNGBDBM261330(US10092570, Example 352 | US9707233, 350)
Affinity DataIC50: <10nMpH: 6.7 T: 2°C. Assay description: [γ-33P]ATP (10 mCi/mL) was purchased from Perkin-Elmer (Waltham, Mass.). Lipid kinase substrate, D-myo-Phosphatidylinositol 4,5-bisphosphate (Pt...
Ligand InfoPC cidPC sid
In DepthDetails US Patent