BDBM26599 4-({4-[(4-carboxybenzene)sulfonyl]phenyl}sulfanyl)benzene-1,2-dicarboxylic acid::benzene-1,2-dioic acid, 24
SMILES OC(=O)c1ccc(cc1)S(=O)(=O)c1ccc(Sc2ccc(C(O)=O)c(c2)C(O)=O)cc1
InChI Key InChIKey=LACLXLZSEHMSBB-UHFFFAOYSA-N
Data  1 IC50
  Tab Delimited (TSV)   2D SDfile   Computed 3D by Vconf -m prep SDfile
Find this compound or compounds like it in BindingDB:
Activity Spreadsheet -- Enzyme Inhibition Constant Data from BindingDB
Found 1 hit for monomerid = 26599
TargetDNA-(apurinic or apyrimidinic site) endonuclease(Homo sapiens (Human))
University of Southern California
LigandPNGBDBM26599(4-({4-[(4-carboxybenzene)sulfonyl]phenyl}sulfanyl)...)
Affinity DataIC50:  6.00E+3nMpH: 7.5 T: 2°C. Assay description: To determine the extent of abasic residue cleavage by APE1, recombinant APE1 was preincubated with the potential inhibitors in reaction buffer. Then,...
In DepthDetails ArticlePubMed