BDBM26600 4-{[4-(4-carboxyphenoxy)benzene]sulfonyl}benzene-1,2-dicarboxylic acid::benzene-1,2-dioic acid, 25::cid_1982091
SMILES OC(=O)c1ccc(Oc2ccc(cc2)S(=O)(=O)c2ccc(C(O)=O)c(c2)C(O)=O)cc1
InChI Key InChIKey=KZRHRPKYHRQAHF-UHFFFAOYSA-N
Data  2 IC50
  Tab Delimited (TSV)   2D SDfile   Computed 3D by Vconf -m prep SDfile
Find this compound or compounds like it in BindingDB:
Activity Spreadsheet -- Enzyme Inhibition Constant Data from BindingDB
Found 2 hits for monomerid = 26600
TargetCarboxy-terminal domain RNA polymerase II polypeptide A small phosphatase 1(Homo sapiens (Human))
Burnham Center For Chemical Genomics
Curated by PubChem BioAssay
LigandPNGBDBM26600(4-{[4-(4-carboxyphenoxy)benzene]sulfonyl}benzene-1...)
Affinity DataIC50:  6.97E+3nM. Assay description: Data Source: Sanford-Burnham Center for Chemical Genomics (SBCCG) Source Affiliation: Sanford-Burnham Medical Research Institute (SBMRI, San Diego, C...
In DepthDetails PCBioAssay
TargetDNA-(apurinic or apyrimidinic site) endonuclease(Homo sapiens (Human))
University of Southern California
LigandPNGBDBM26600(4-{[4-(4-carboxyphenoxy)benzene]sulfonyl}benzene-1...)
Affinity DataIC50:  1.00E+4nMpH: 7.5 T: 2°C. Assay description: To determine the extent of abasic residue cleavage by APE1, recombinant APE1 was preincubated with the potential inhibitors in reaction buffer. Then,...
In DepthDetails ArticlePubMed