BDBM26602 2-{5-[(3Z)-1-(carboxymethyl)-2-oxo-2,3-dihydro-1H-indol-3-ylidene]-4-oxo-2-sulfanylidene-1,3-thiazolidin-3-yl}-3-phenylpropanoic acid::oxoindole-thioxothiazolidinone, 27
SMILES OC(=O)CN1C(=O)\C(=C2/SC(=S)N(C(Cc3ccccc3)C(O)=O)C2=O)c2ccccc12
InChI Key InChIKey=QGLHZICYIJSLGU-ZCXUNETKSA-N
Data  3 IC50
  Tab Delimited (TSV)   2D SDfile   Computed 3D by Vconf -m prep SDfile
Find this compound or compounds like it in BindingDB:
Activity Spreadsheet -- Enzyme Inhibition Constant Data from BindingDB
Found 3 hits for monomerid = 26602
TargetDNA-(apurinic or apyrimidinic site) endonuclease(Homo sapiens (Human))
University of Southern California
LigandPNGBDBM26602(2-{5-[(3Z)-1-(carboxymethyl)-2-oxo-2,3-dihydro-1H-...)
Affinity DataIC50:  3.00E+3nM. Assay description: To determine the extent of abasic residue cleavage by APE1, recombinant APE1 was preincubated with the potential inhibitors in reaction buffer. Then,...
In DepthDetails ArticlePubMed
TargetIntegrase(Human immunodeficiency virus 1)
University Of Southern California
Curated by ChEMBL
LigandPNGBDBM26602(2-{5-[(3Z)-1-(carboxymethyl)-2-oxo-2,3-dihydro-1H-...)
Affinity DataIC50:  66nM. Assay description: Inhibition of HIV1 integrase strand transfer activity
In DepthDetails ArticlePubMed
TargetIntegrase(Human immunodeficiency virus 1)
University Of Southern California
Curated by ChEMBL
LigandPNGBDBM26602(2-{5-[(3Z)-1-(carboxymethyl)-2-oxo-2,3-dihydro-1H-...)
Affinity DataIC50:  92nM. Assay description: Inhibition of HIV1 integrase 3'-end processing activity
In DepthDetails ArticlePubMed