BDBM267714 4-(8-amino-5-chloro-3-(4-(3-methyloxetane-3-carbonyl)morpholin-2-yl)imidazo[1,5-a]pyrazin-1-yl)-N-(4-(trifluoromethyl) pyridin-2-yl)benzamide::US9718828, Example, 316
SMILES Nc1ncc(Cl)n2c(nc(-c3ccc(cc3)C(=O)Nc3cc(ccn3)C(F)(F)F)c12)C1CN(CCO1)C(=O)C1(O)CCC1
InChI Key InChIKey=KFHYWEPPMQWUIN-UHFFFAOYSA-N
Data  1 EC50
  Tab Delimited (TSV)   2D SDfile   Computed 3D by Vconf -m prep SDfile
Find this compound or compounds like it in BindingDB:
Activity Spreadsheet -- Enzyme Inhibition Constant Data from BindingDB
Found 1 hit for monomerid = 267714
TargetTyrosine-protein kinase BTK(Homo sapiens (Human))
Merck Sharp & Dohme
US Patent
LigandPNGBDBM267714(4-(8-amino-5-chloro-3-(4-(3-methyloxetane-3-carbon...)
Affinity DataEC50: <10nMpH: 7.2 T: 2°C. Assay description: Btk enzyme activity is measured using the IMAP (immobilized metal ion affinity-based fluorescence polarization) assay as outlined below. Btk enzyme (...
Ligand InfoPC cidPC sid
In DepthDetails US Patent