BDBM269003 N-[4-(3-Amino-1H-pyrazolo[3,4-d]pyrimidin-6-yl)-phenyl]-5-chloro-2-cyano-benzenesulfonamide::US9718825, Example 446
SMILES Nc1n[nH]c2nc(ncc12)-c1ccc(NS(=O)(=O)c2cc(Cl)ccc2C#N)cc1
InChI Key InChIKey=VYIKAHZTFTUSJO-UHFFFAOYSA-N
Data  8 IC50
  Tab Delimited (TSV)   2D SDfile   Computed 3D by Vconf -m prep SDfile
Find this compound or compounds like it in BindingDB:
Activity Spreadsheet -- Enzyme Inhibition Constant Data from BindingDB
Found 8 hits for monomerid = 269003
TargetSerine/threonine-protein kinase Sgk1(Homo sapiens (Human))
Sanofi
US Patent
LigandPNGBDBM269003(N-[4-(3-Amino-1H-pyrazolo[3,4-d]pyrimidin-6-yl)-ph...)
Affinity DataIC50:  1.60nMpH: 7.4Assay Description:The compounds were tested for serum and glucocorticoid-regulated kinase 1 (SGK-1) inhibitory activity in a substrate phosphorylation assay designed t...
Ligand InfoPC cidPC sid
In DepthDetails US Patent
TargetCytochrome P450 3A4(Homo sapiens (Human))
Sanofi R&D
Curated by ChEMBL
LigandPNGBDBM269003(N-[4-(3-Amino-1H-pyrazolo[3,4-d]pyrimidin-6-yl)-ph...)
Affinity DataIC50: >3.00E+4nM. Assay description: Inhibition of CYP3A4 in human liver microsomes using testosterone as substrate incubated for 30 mins by LC-MS/MS analysis
Ligand InfoPC cidPC sid
In DepthDetails ArticlePubMed
TargetSerine/threonine-protein kinase Sgk1(Homo sapiens (Human))
Sanofi
US Patent
LigandPNGBDBM269003(N-[4-(3-Amino-1H-pyrazolo[3,4-d]pyrimidin-6-yl)-ph...)
Affinity DataIC50:  3nM. Assay description: Inhibition of recombinant human SGK1 expressed in baculovirus expression system using 5-carboxyfluorescein -RPRAATF-NH2 as substrate preincubated for...
Ligand InfoPC cidPC sid
In DepthDetails ArticlePubMed
TargetCytochrome P450 3A4(Homo sapiens (Human))
Sanofi R&D
Curated by ChEMBL
LigandPNGBDBM269003(N-[4-(3-Amino-1H-pyrazolo[3,4-d]pyrimidin-6-yl)-ph...)
Affinity DataIC50: >3.00E+4nM. Assay description: Inhibition of CYP3A4 in human liver microsomes using midazolam as substrate incubated for 10 mins by LC-MS/MS analysis
Ligand InfoPC cidPC sid
In DepthDetails ArticlePubMed
TargetSerine/threonine-protein kinase Sgk2(Homo sapiens)
Sanofi R&D
Curated by ChEMBL
LigandPNGBDBM269003(N-[4-(3-Amino-1H-pyrazolo[3,4-d]pyrimidin-6-yl)-ph...)
Affinity DataIC50:  21nM. Assay description: Inhibition of human SGK2 in presence 500 uM presence of ATP
Ligand InfoPC cidPC sid
In DepthDetails ArticlePubMed
TargetSerine/threonine-protein kinase Sgk3(Homo sapiens (Human))
Sanofi R&D
Curated by ChEMBL
LigandPNGBDBM269003(N-[4-(3-Amino-1H-pyrazolo[3,4-d]pyrimidin-6-yl)-ph...)
Affinity DataIC50:  211nM. Assay description: Inhibition of human SGK3 in presence 500 uM presence of ATP
Ligand InfoPC cidPC sid
In DepthDetails ArticlePubMed
TargetSerine/threonine-protein kinase Sgk1(Mus musculus (Mouse))
Sanofi R&D
Curated by ChEMBL
LigandPNGBDBM269003(N-[4-(3-Amino-1H-pyrazolo[3,4-d]pyrimidin-6-yl)-ph...)
Affinity DataIC50:  294nM. Assay description: Inhibition of mouse SGK1 in presence 500 uM presence of ATP
Ligand InfoPC cidPC sid
In DepthDetails ArticlePubMed
TargetSerine/threonine-protein kinase Sgk1(Homo sapiens (Human))
Sanofi
US Patent
LigandPNGBDBM269003(N-[4-(3-Amino-1H-pyrazolo[3,4-d]pyrimidin-6-yl)-ph...)
Affinity DataIC50:  9nM. Assay description: Inhibition of recombinant human SGK1 expressed in baculovirus expression system using 5-carboxyfluorescein -RPRAATF-NH2 as substrate preincubated for...
Ligand InfoPC cidPC sid
In DepthDetails ArticlePubMed