BDBM27141 2-(2-methylpiperidin-2-yl)-1H-1,3-benzodiazole-4-carboxamide::benzimidazole carboxamide, 8a
SMILES CC1(CCCCN1)c1nc2cccc(C(N)=O)c2[nH]1
InChI Key InChIKey=JOCGPVNERHRBMY-UHFFFAOYSA-N
Data  1 KI
  Tab Delimited (TSV)   2D SDfile   Computed 3D by Vconf -m prep SDfile
Find this compound or compounds like it in BindingDB:
Activity Spreadsheet -- Enzyme Inhibition Constant Data from BindingDB
Found 1 hit for monomerid = 27141
TargetPoly [ADP-ribose] polymerase 1(Homo sapiens (Human))
Abbott Laboratories
LigandPNGBDBM27141(2-(2-methylpiperidin-2-yl)-1H-1,3-benzodiazole-4-c...)
Affinity DataKi:  5nM ΔG°:  -11.2kcal/molepH: 8.0 T: 2°C. Assay description: PARP assays utilizing SPA bead-based detection were carried out in 96-well plates. After reaction was terminated, the reaction mixtures were transfer...
In DepthDetails ArticlePubMed