BDBM275285 US9556187, Example 369
SMILES [N-]=[N+]=NC[C@H]1CC[C@@H](CC1)c1nnn2cnc3[nH]ccc3c12
InChI Key
Data  4 IC50
  Tab Delimited (TSV)   2D SDfile   Computed 3D by Vconf -m prep SDfile
Find this compound or compounds like it in BindingDB:
Activity Spreadsheet -- Enzyme Inhibition Constant Data from BindingDB
Found 4 hits for monomerid = 275285
TargetTyrosine-protein kinase JAK1(Homo sapiens (Human))
Nissan Chemical Industries
US Patent
LigandPNGBDBM275285(US9556187, Example 369)
Affinity DataIC50:  0.330nMT: 2°C. Assay description: JAK1, JAK2, JAK3 and Tyk2 were purchased from Carna Biosciences, Inc. As the substrate, LANCE Ultra ULight-JAK1 Peptide (manufactured by PerkinElmer ...
Ligand InfoPC cidPC sid
In DepthDetails US Patent
TargetNon-receptor tyrosine-protein kinase TYK2(Homo sapiens (Human))
Nissan Chemical Industries
US Patent
LigandPNGBDBM275285(US9556187, Example 369)
Affinity DataIC50:  9.20nMT: 2°C. Assay description: JAK1, JAK2, JAK3 and Tyk2 were purchased from Carna Biosciences, Inc. As the substrate, LANCE Ultra ULight-JAK1 Peptide (manufactured by PerkinElmer ...
Ligand InfoPC cidPC sid
In DepthDetails US Patent
TargetTyrosine-protein kinase JAK3(Homo sapiens (Human))
Nissan Chemical Industries
US Patent
LigandPNGBDBM275285(US9556187, Example 369)
Affinity DataIC50:  48nMT: 2°C. Assay description: JAK1, JAK2, JAK3 and Tyk2 were purchased from Carna Biosciences, Inc. As the substrate, LANCE Ultra ULight-JAK1 Peptide (manufactured by PerkinElmer ...
Ligand InfoPC cidPC sid
In DepthDetails US Patent
TargetTyrosine-protein kinase JAK2(Homo sapiens (Human))
Nissan Chemical Industries
US Patent
LigandPNGBDBM275285(US9556187, Example 369)
Affinity DataIC50:  1.70nMT: 2°C. Assay description: JAK1, JAK2, JAK3 and Tyk2 were purchased from Carna Biosciences, Inc. As the substrate, LANCE Ultra ULight-JAK1 Peptide (manufactured by PerkinElmer ...
Ligand InfoPC cidPC sid
In DepthDetails US Patent