BDBM278176 2-(((3R,4S)-1-((S)-2,3-dihydroxypropanoyl)-3-fluoropiperidin-4-yl)oxy)-5-(4-((4-(((3R,4S)-3-fluoro-1-methylpiperidin-4-yl)oxy)phenyl)amino)-1,3,5-triazin-2-yl)benzonitrile::US10040781, Example 398::US10253019, Example 398
SMILES CN1CC[C@H](Oc2ccc(Nc3ncnc(n3)-c3ccc(O[C@H]4CCN(C[C@H]4F)C(=O)[C@@H](O)CO)c(c3)C#N)cc2)[C@H](F)C1
InChI Key InChIKey=MAGYPARKFHXVPO-IUJPGNIVSA-N
Data  6 IC50
  Tab Delimited (TSV)   2D SDfile   Computed 3D by Vconf -m prep SDfile
Find this compound or compounds like it in BindingDB:
Activity Spreadsheet -- Enzyme Inhibition Constant Data from BindingDB
Found 6 hits for monomerid = 278176
TargetSerine/threonine-protein kinase TBK1(Homo sapiens (Human))
Gilead Sciences
US Patent
LigandPNGBDBM278176(2-(((3R,4S)-1-((S)-2,3-dihydroxypropanoyl)-3-fluor...)
Affinity DataIC50:  3.00E+3nMpH: 7.0Assay Description:Enzymatic activity of IKKε and TBK1 was measured using a homogeneous time resolved fluorescence resonance energy transfer (TR-FRET) assay that m...
Ligand InfoPC cidPC sid
In DepthDetails US Patent
TargetInhibitor of nuclear factor kappa-B kinase subunit epsilon(Homo sapiens (Human))
Gilead Sciences
US Patent
LigandPNGBDBM278176(2-(((3R,4S)-1-((S)-2,3-dihydroxypropanoyl)-3-fluor...)
Affinity DataIC50:  1.00E+3nMpH: 7.0Assay Description:Enzymatic activity of IKKε and TBK1 was measured using a homogeneous time resolved fluorescence resonance energy transfer (TR-FRET) assay that m...
Ligand InfoPC cidPC sid
In DepthDetails US Patent
TargetTyrosine-protein kinase JAK2(Homo sapiens (Human))
Gilead Sciences
US Patent
LigandPNGBDBM278176(2-(((3R,4S)-1-((S)-2,3-dihydroxypropanoyl)-3-fluor...)
Affinity DataIC50:  763nM. Assay description: Enzymatic activity of hJAK2 was measured using a LANCE homogeneous time resolved fluorescence resonance energy transfer (TR-FRET) assay that monitors...
Ligand InfoPC cidPC sid
In DepthDetails US Patent
TargetSerine/threonine-protein kinase TBK1(Homo sapiens (Human))
Gilead Sciences
US Patent
LigandPNGBDBM278176(2-(((3R,4S)-1-((S)-2,3-dihydroxypropanoyl)-3-fluor...)
Affinity DataIC50:  3nM. Assay description: Enzymatic activity of IKKε and TBK1 was measured using a homogeneous time resolved fluorescence resonance energy transfer (TR-FRET) assay that m...
Ligand InfoPC cidPC sid
In DepthDetails US Patent
TargetInhibitor of nuclear factor kappa-B kinase subunit epsilon(Homo sapiens (Human))
Gilead Sciences
US Patent
LigandPNGBDBM278176(2-(((3R,4S)-1-((S)-2,3-dihydroxypropanoyl)-3-fluor...)
Affinity DataIC50:  1nM. Assay description: Enzymatic activity of IKKε and TBK1 was measured using a homogeneous time resolved fluorescence resonance energy transfer (TR-FRET) assay that m...
Ligand InfoPC cidPC sid
In DepthDetails US Patent
TargetTyrosine-protein kinase JAK2(Homo sapiens (Human))
Gilead Sciences
US Patent
LigandPNGBDBM278176(2-(((3R,4S)-1-((S)-2,3-dihydroxypropanoyl)-3-fluor...)
Affinity DataIC50:  7.63E+5nMpH: 7.5Assay Description:Enzymatic activity of hJAK2 was measured using a LANCE homogeneous time resolved fluorescence resonance energy transfer (TR-FRET) assay that monitors...
Ligand InfoPC cidPC sid
In DepthDetails US Patent