BDBM279958 US10028961, Compound 111::US10172864, Compound 111::US10946023, Compound 111
SMILES FC(F)(F)c1cccc(n1)-c1nc(N[C@@H]2CCC(F)(F)C2)nc(N[C@@H]2CCC(F)(F)C2)n1
InChI Key InChIKey=JWMKUJAOIPXYIG-GHMZBOCLSA-N
Data  9 IC50
  Tab Delimited (TSV)   2D SDfile   Computed 3D by Vconf -m prep SDfile
Find this compound or compounds like it in BindingDB:
Activity Spreadsheet -- Enzyme Inhibition Constant Data from BindingDB
Found 9 hits for monomerid = 279958
TargetIsocitrate dehydrogenase [NADP] cytoplasmic [R132H](Homo sapiens (Human))
Agios Pharmaceuticals
US Patent
LigandPNGBDBM279958(US10028961, Compound 111 | US10172864, Compound 11...)
Affinity DataIC50: <50nMpH: 6.5 T: 2°C. Assay description: In the primary reaction, the reduction of α-KG acid to 2-HG is accompanied by a concomitant oxidation of NADPH to NADP. The amount of NADPH rema...
Ligand InfoPC cidPC sid
In DepthDetails US Patent
TargetIsocitrate dehydrogenase [NADP], mitochondrial [R140Q](Homo sapiens (Human))
Agios Pharmaceuticals
US Patent
LigandPNGBDBM279958(US10028961, Compound 111 | US10172864, Compound 11...)
Affinity DataIC50: <50nMpH: 7.5 T: 2°C. Assay description: Compounds are assayed for IDH2 R140Q inhibitory activity through a cofactor depletion assay. Compounds are preincubated with enzyme, then the reactio...
Ligand InfoPC cidPC sid
In DepthDetails US Patent
TargetIsocitrate dehydrogenase [NADP] cytoplasmic [R132H](Homo sapiens (Human))
Agios Pharmaceuticals
US Patent
LigandPNGBDBM279958(US10028961, Compound 111 | US10172864, Compound 11...)
Affinity DataIC50: <50nMpH: 7.5 T: 2°C. Assay description: A test compound is prepared as 10 mM stock in DMSO and diluted to 50× final concentration in DMSO, for a 50 μl reaction mixture. IDH enzyme acti...
Ligand InfoPC cidPC sid
In DepthDetails US Patent
TargetIsocitrate dehydrogenase [NADP] cytoplasmic [R132H](Homo sapiens (Human))
Agios Pharmaceuticals
US Patent
LigandPNGBDBM279958(US10028961, Compound 111 | US10172864, Compound 11...)
Affinity DataIC50: <50nM. Assay description: In the primary reaction, the reduction of α-KG acid to 2-HG is accompanied by a concomitant oxidation of NADPH to NADP. The amount of NADPH rema...
Ligand InfoPC cidPC sid
In DepthDetails US Patent
TargetIsocitrate dehydrogenase [NADP] cytoplasmic [R132H](Homo sapiens (Human))
Agios Pharmaceuticals
US Patent
LigandPNGBDBM279958(US10028961, Compound 111 | US10172864, Compound 11...)
Affinity DataIC50: <50nM. Assay description: A test compound is prepared as 10 mM stock in DMSO and diluted to 50× final concentration in DMSO, for a 50 μl reaction mixture. IDH enzyme acti...
Ligand InfoPC cidPC sid
In DepthDetails US Patent
TargetIsocitrate dehydrogenase [NADP] cytoplasmic [R132H](Homo sapiens (Human))
Agios Pharmaceuticals
US Patent
LigandPNGBDBM279958(US10028961, Compound 111 | US10172864, Compound 11...)
Affinity DataIC50: <50nM. Assay description: A test compound is prepared as 10 mM stock in DMSO and diluted to 50× final concentration in DMSO, for a 50 μl reaction mixture. IDH enzyme acti...
Ligand InfoPC cidPC sid
In DepthDetails US Patent
TargetIsocitrate dehydrogenase [NADP] cytoplasmic [R132H](Homo sapiens (Human))
Agios Pharmaceuticals
US Patent
LigandPNGBDBM279958(US10028961, Compound 111 | US10172864, Compound 11...)
Affinity DataIC50: <50nM. Assay description: In the primary reaction, the reduction of α-KG acid to 2-HG is accompanied by a concomitant oxidation of NADPH to NADP. The amount of NADPH rema...
Ligand InfoPC cidPC sid
In DepthDetails US Patent
TargetIsocitrate dehydrogenase [NADP], mitochondrial [R140Q](Homo sapiens (Human))
Agios Pharmaceuticals
US Patent
LigandPNGBDBM279958(US10028961, Compound 111 | US10172864, Compound 11...)
Affinity DataIC50: <50nM. Assay description: Compounds are assayed for IDH2 R140Q inhibitory activity through a cofactor depletion assay. Compounds are preincubated with enzyme, then the reactio...
Ligand InfoPC cidPC sid
In DepthDetails US Patent
TargetIsocitrate dehydrogenase [NADP], mitochondrial [R140Q](Homo sapiens (Human))
Agios Pharmaceuticals
US Patent
LigandPNGBDBM279958(US10028961, Compound 111 | US10172864, Compound 11...)
Affinity DataIC50: <50nM. Assay description: Compounds are assayed for IDH2 R140Q inhibitory activity through a cofactor depletion assay. Compounds are preincubated with enzyme, then the reactio...
Ligand InfoPC cidPC sid
In DepthDetails US Patent