BDBM280470 US10030020, Example 15::US10781211, Example 15
SMILES FC(F)(F)C(OC(=O)N1CCC2(CCCN2Cc2ccc(OCCN3CCCCC3)c(Cl)c2)CC1)C(F)(F)F
InChI Key InChIKey=CFSKEDXSPRDWJR-UHFFFAOYSA-N
Data  6 IC50
  Tab Delimited (TSV)   2D SDfile   Computed 3D by Vconf -m prep SDfile
Find this compound or compounds like it in BindingDB:
Activity Spreadsheet -- Enzyme Inhibition Constant Data from BindingDB
Found 6 hits for monomerid = 280470
TargetMonoglyceride lipase(Mus musculus (mouse))
Abide Therapeutics
US Patent
LigandPNGBDBM280470(US10030020, Example 15 | US10781211, Example 15)
Affinity DataIC50:  550nM. Assay description: Proteomes (mouse brain membrane fraction or cell lysates) (50 μL, 1.0 mg/mL total protein concentration) were preincubated with varying concentr...
Ligand InfoPC cidPC sid
In DepthDetails US Patent
TargetFatty-acid amide hydrolase 1(Mus musculus (mouse))
Abide Therapeutics
US Patent
LigandPNGBDBM280470(US10030020, Example 15 | US10781211, Example 15)
Affinity DataIC50: >1.00E+3nM. Assay description: Proteomes (mouse brain membrane fraction or cell lysates) (50 μL, 1.0 mg/mL total protein concentration) were preincubated with varying concentr...
Ligand InfoPC cidPC sid
In DepthDetails US Patent
TargetMonoacylglycerol lipase ABHD6(Mus musculus (mouse))
Lundbeck La Jolla Research Center
US Patent
LigandPNGBDBM280470(US10030020, Example 15 | US10781211, Example 15)
Affinity DataIC50: >1.00E+3nM. Assay description: MAGL, ABHD6 and FAAH: Proteomes (mouse brain membrane fraction or cell lysates) (50 μL, 1.0 mg/mL total protein concentration) were preincubated...
Ligand InfoPC cidPC sid
In DepthDetails US Patent
TargetMonoglyceride lipase(Mus musculus (mouse))
Abide Therapeutics
US Patent
LigandPNGBDBM280470(US10030020, Example 15 | US10781211, Example 15)
Affinity DataIC50:  550nM. Assay description: MAGL, ABHD6 and FAAH: Proteomes (mouse brain membrane fraction or cell lysates) (50 μL, 1.0 mg/mL total protein concentration) were preincubated...
Ligand InfoPC cidPC sid
In DepthDetails US Patent
TargetFatty-acid amide hydrolase 1(Mus musculus (mouse))
Abide Therapeutics
US Patent
LigandPNGBDBM280470(US10030020, Example 15 | US10781211, Example 15)
Affinity DataIC50: >1.00E+3nM. Assay description: MAGL, ABHD6 and FAAH: Proteomes (mouse brain membrane fraction or cell lysates) (50 μL, 1.0 mg/mL total protein concentration) were preincubated...
Ligand InfoPC cidPC sid
In DepthDetails US Patent
TargetMonoacylglycerol lipase ABHD2(Mus musculus (Mouse))
Abide Therapeutics
US Patent
LigandPNGBDBM280470(US10030020, Example 15 | US10781211, Example 15)
Affinity DataIC50: >1.00E+3nM. Assay description: Proteomes (mouse brain membrane fraction or cell lysates) (50 μL, 1.0 mg/mL total protein concentration) were preincubated with varying concentr...
Ligand InfoPC cidPC sid
In DepthDetails US Patent