BDBM281541 US10022387, Example 67::US10596184, Example 67::US9586949, Example 67
SMILES Cc1nc([nH]c1C)-c1nc2ccc(cc2o1)-c1cncc(c1)C(O)C(F)(F)F
InChI Key
Data  6 IC50
  Tab Delimited (TSV)   2D SDfile   Computed 3D by Vconf -m prep SDfile
Find this compound or compounds like it in BindingDB:
Activity Spreadsheet -- Enzyme Inhibition Constant Data from BindingDB
Found 6 hits for monomerid = 281541
LigandPNGBDBM281541(US10022387, Example 67 | US10596184, Example 67 | ...)
Affinity DataIC50: <250nMpH: 6.7 T: 2°C. Assay description: [γ-33P]ATP (10 mCi/mL) and Wheat Germ Agglutinin (WGA) YSi SPA Scintillation Beads was purchased from Perkin-Elmer (Waltham, Mass.). Lipid kinas...
Ligand InfoPC cidPC sid
In DepthDetails US Patent
LigandPNGBDBM281541(US10022387, Example 67 | US10596184, Example 67 | ...)
Affinity DataIC50: <250nMpH: 6.7 T: 2°C. Assay description: [γ-33P]ATP (10 mCi/mL) and Wheat Germ Agglutinin (WGA) YSi SPA Scintillation Beads was purchased from Perkin-Elmer (Waltham, Mass.). Lipid kinas...
Ligand InfoPC cidPC sid
In DepthDetails US Patent
LigandPNGBDBM281541(US10022387, Example 67 | US10596184, Example 67 | ...)
Affinity DataIC50: <250nM. Assay description: PI3Kdelta: The kinase reaction was conducted in polystyrene 384-well Greiner Bio-one white plate from Thermo Fisher Scientific in a final volume of 2...
Ligand InfoPC cidPC sid
In DepthDetails US Patent
LigandPNGBDBM281541(US10022387, Example 67 | US10596184, Example 67 | ...)
Affinity DataIC50: <250nMpH: 6.7 T: 2°C. Assay description: [γ-33P]ATP (10 mCi/mL) and Wheat Germ Agglutinin (WGA) YSi SPA Scintillation Beads was purchased from Perkin-Elmer (Waltham, Mass.). Lipid kinas...
Ligand InfoPC cidPC sid
In DepthDetails US Patent
LigandPNGBDBM281541(US10022387, Example 67 | US10596184, Example 67 | ...)
Affinity DataIC50: <250nM. Assay description: PI3K-gamma:The kinase reaction was conducted in polystyrene 384-well Greiner Bio-one white plate from Thermo Fisher Scientific in a final volume of 2...
Ligand InfoPC cidPC sid
In DepthDetails US Patent
LigandPNGBDBM281541(US10022387, Example 67 | US10596184, Example 67 | ...)
Affinity DataIC50: <250nMpH: 6.7 T: 2°C. Assay description: γ-33P]ATP (10 mCi/mL) and Wheat Germ Agglutinin (WGA) YSi SPA Scintillation Beads was purchased from Perkin-Elmer (Waltham, Mass.). Lipid kinase...
Ligand InfoPC cidPC sid
In DepthDetails US Patent