BDBM281553 N-(5-(2-(1H-Benzo[d]imidazol-2- yl)benzo[d]oxazol-6-yl)-2- methoxypyridin-3- yl)ethanesulfonamide bis(trifluoroacetate)::US10022387, Example 79::US10596184, Example 79::US9586949, Example 79
SMILES CCS(=O)(=O)Nc1cc(cnc1OC)-c1ccc2nc(oc2c1)-c1nc2ccccc2[nH]1
InChI Key InChIKey=CMKPDKCAEGGBIX-UHFFFAOYSA-N
Data  6 IC50
  Tab Delimited (TSV)   2D SDfile   Computed 3D by Vconf -m prep SDfile
Find this compound or compounds like it in BindingDB:
Activity Spreadsheet -- Enzyme Inhibition Constant Data from BindingDB
Found 6 hits for monomerid = 281553
LigandPNGBDBM281553(N-(5-(2-(1H-Benzo[d]imidazol-2- yl)benzo[d]oxazol-...)
Affinity DataIC50: <250nMpH: 6.7 T: 2°C. Assay description: [γ-33P]ATP (10 mCi/mL) and Wheat Germ Agglutinin (WGA) YSi SPA Scintillation Beads was purchased from Perkin-Elmer (Waltham, Mass.). Lipid kinas...
Ligand InfoPC cidPC sid
In DepthDetails US Patent
LigandPNGBDBM281553(N-(5-(2-(1H-Benzo[d]imidazol-2- yl)benzo[d]oxazol-...)
Affinity DataIC50: <250nMpH: 6.7 T: 2°C. Assay description: [γ-33P]ATP (10 mCi/mL) and Wheat Germ Agglutinin (WGA) YSi SPA Scintillation Beads was purchased from Perkin-Elmer (Waltham, Mass.). Lipid kinas...
Ligand InfoPC cidPC sid
In DepthDetails US Patent
LigandPNGBDBM281553(N-(5-(2-(1H-Benzo[d]imidazol-2- yl)benzo[d]oxazol-...)
Affinity DataIC50: <250nM. Assay description: PI3Kdelta: The kinase reaction was conducted in polystyrene 384-well Greiner Bio-one white plate from Thermo Fisher Scientific in a final volume of 2...
Ligand InfoPC cidPC sid
In DepthDetails US Patent
LigandPNGBDBM281553(N-(5-(2-(1H-Benzo[d]imidazol-2- yl)benzo[d]oxazol-...)
Affinity DataIC50: <250nMpH: 6.7 T: 2°C. Assay description: [γ-33P]ATP (10 mCi/mL) and Wheat Germ Agglutinin (WGA) YSi SPA Scintillation Beads was purchased from Perkin-Elmer (Waltham, Mass.). Lipid kinas...
Ligand InfoPC cidPC sid
In DepthDetails US Patent
LigandPNGBDBM281553(N-(5-(2-(1H-Benzo[d]imidazol-2- yl)benzo[d]oxazol-...)
Affinity DataIC50: <250nM. Assay description: PI3K-gamma:The kinase reaction was conducted in polystyrene 384-well Greiner Bio-one white plate from Thermo Fisher Scientific in a final volume of 2...
Ligand InfoPC cidPC sid
In DepthDetails US Patent
LigandPNGBDBM281553(N-(5-(2-(1H-Benzo[d]imidazol-2- yl)benzo[d]oxazol-...)
Affinity DataIC50: <250nMpH: 6.7 T: 2°C. Assay description: γ-33P]ATP (10 mCi/mL) and Wheat Germ Agglutinin (WGA) YSi SPA Scintillation Beads was purchased from Perkin-Elmer (Waltham, Mass.). Lipid kinase...
Ligand InfoPC cidPC sid
In DepthDetails US Patent