BDBM28452 (2R,3R,4S,5R)-2-(6-amino-8-methyl-9H-purin-9-yl)-5-[(dimethylamino)methyl]oxolane-3,4-diol::AdoMet substrate analogue, 23a
SMILES CN(C)C[C@H]1O[C@H]([C@H](O)[C@@H]1O)n1c(C)nc2c(N)ncnc12
InChI Key InChIKey=BDRUNDKEQQVJJG-QYVSTXNMSA-N
Data  1 IC50
PDB links: 1 PDB ID matches this monomer.
  Tab Delimited (TSV)   2D SDfile   Computed 3D by Vconf -m prep SDfile
Find this compound or compounds like it in BindingDB:
Activity Spreadsheet -- Enzyme Inhibition Constant Data from BindingDB
Found 1 hit for monomerid = 28452
TargetS-adenosylmethionine decarboxylase proenzyme(Homo sapiens (Human))
Cornell University
LigandPNGBDBM28452((2R,3R,4S,5R)-2-(6-amino-8-methyl-9H-purin-9-yl)-5...)
Affinity DataIC50:  600nM. Assay description: The C-terminal his-tagged AdoMetDC was assayed by measuring the release of 14CO2 from S-adenosyl-L-[carboxy-14C]methionine (Amersham Pharmacia Biotec...