BDBM28664 2-methyl-6-{[3-(1,2,3,4-tetrahydroisoquinoline-2-sulfonyl)benzene]amido}benzoic acid::Anthranilic acid deriv., 2
SMILES Cc1cccc(NC(=O)c2cccc(c2)S(=O)(=O)N2CCc3ccccc3C2)c1C(O)=O
InChI Key InChIKey=FHGXQWVKVRXZHN-UHFFFAOYSA-N
Data  3 IC50  1 EC50
  Tab Delimited (TSV)   2D SDfile   Computed 3D by Vconf -m prep SDfile
Find this compound or compounds like it in BindingDB:
Activity Spreadsheet -- Enzyme Inhibition Constant Data from BindingDB
Found 3 hits for monomerid = 28664
LigandPNGBDBM28664(2-methyl-6-{[3-(1,2,3,4-tetrahydroisoquinoline-2-s...)
Affinity DataIC50: >1.00E+4nM EC50: >1.00E+4nMpH: 7.0 T: 2°C. Assay description: Competition-binding curves for test compounds were determined with expressed human PPAR LBD. Plots of inhibitor concentration versus cpm of radioliga...
In DepthDetails ArticlePubMed
LigandPNGBDBM28664(2-methyl-6-{[3-(1,2,3,4-tetrahydroisoquinoline-2-s...)
Affinity DataIC50: >1.00E+4nM. Assay description: Competition-binding curves for test compounds were determined with expressed human PPAR LBD. Plots of inhibitor concentration versus cpm of radioliga...
In DepthDetails ArticlePubMed
LigandPNGBDBM28664(2-methyl-6-{[3-(1,2,3,4-tetrahydroisoquinoline-2-s...)
Affinity DataIC50: >1.00E+4nMpH: 7.0 T: 2°C. Assay description: Competition-binding curves for test compounds were determined with expressed human PPAR LBD. Plots of inhibitor concentration versus cpm of radioliga...
In DepthDetails ArticlePubMed