BDBM28670 4-bromo-2-{[3-(1,2,3,4-tetrahydroisoquinoline-2-sulfonyl)benzene]amido}benzoic acid::Anthranilic acid deriv., 8
SMILES OC(=O)c1ccc(Br)cc1NC(=O)c1cccc(c1)S(=O)(=O)N1CCc2ccccc2C1
InChI Key InChIKey=KLJBPOPFORASKN-UHFFFAOYSA-N
Data  6 IC50  1 EC50
  Tab Delimited (TSV)   2D SDfile   Computed 3D by Vconf -m prep SDfile
Find this compound or compounds like it in BindingDB:
Activity Spreadsheet -- Enzyme Inhibition Constant Data from BindingDB
Found 6 hits for monomerid = 28670
LigandPNGBDBM28670(4-bromo-2-{[3-(1,2,3,4-tetrahydroisoquinoline-2-su...)
Affinity DataIC50:  5nM EC50:  158nMpH: 7.0 T: 2°C. Assay description: Competition-binding curves for test compounds were determined with expressed human PPAR LBD. Plots of inhibitor concentration versus cpm of radioliga...
In DepthDetails ArticlePubMed
LigandPNGBDBM28670(4-bromo-2-{[3-(1,2,3,4-tetrahydroisoquinoline-2-su...)
Affinity DataIC50:  5.01E+3nMpH: 7.0 T: 2°C. Assay description: Competition-binding curves for test compounds were determined with expressed human PPAR LBD. Plots of inhibitor concentration versus cpm of radioliga...
In DepthDetails ArticlePubMed
LigandPNGBDBM28670(4-bromo-2-{[3-(1,2,3,4-tetrahydroisoquinoline-2-su...)
Affinity DataIC50:  5nM. Assay description: Agonist activity at PPARdelta
In DepthDetails ArticlePubMed
LigandPNGBDBM28670(4-bromo-2-{[3-(1,2,3,4-tetrahydroisoquinoline-2-su...)
Affinity DataIC50:  5.01E+3nM. Assay description: Agonist activity at PPARalpha
In DepthDetails ArticlePubMed
TargetPeroxisome proliferator-activated receptor gamma(Homo sapiens (Human))
Universidad Nacional Aut£Noma De M£Xico
Curated by ChEMBL
LigandPNGBDBM28670(4-bromo-2-{[3-(1,2,3,4-tetrahydroisoquinoline-2-su...)
Affinity DataIC50:  3.98E+3nM. Assay description: Agonist activity at PPARgamma
In DepthDetails ArticlePubMed
TargetPeroxisome proliferator-activated receptor gamma(Homo sapiens (Human))
Universidad Nacional Aut£Noma De M£Xico
Curated by ChEMBL
LigandPNGBDBM28670(4-bromo-2-{[3-(1,2,3,4-tetrahydroisoquinoline-2-su...)
Affinity DataIC50:  3.98E+3nM. Assay description: Competition-binding curves for test compounds were determined with expressed human PPAR LBD. Plots of inhibitor concentration versus cpm of radioliga...
In DepthDetails ArticlePubMed