BDBM288349 US10087187, Compound 39
SMILES Cc1nc2c(N)cc(nn2c1Nc1cccc(C)c1C)N1CCOCC1
InChI Key InChIKey=AJDOIAFEXAYFJT-UHFFFAOYSA-N
Data  5 Kd
  Tab Delimited (TSV)   2D SDfile   Computed 3D by Vconf -m prep SDfile
Find this compound or compounds like it in BindingDB:
Activity Spreadsheet -- Enzyme Inhibition Constant Data from BindingDB
Found 5 hits for monomerid = 288349
TargetPhosphatidylinositol 4-phosphate 3-kinase C2 domain-containing subunit alpha(Homo sapiens (Human))
Janssen Pharmaceutica
US Patent
LigandPNGBDBM288349(US10087187, Compound 39)
Affinity DataKd:  2.57E+3nM. Assay description: Kinase enzyme binding affinities of compounds disclosed herein were determined using the KINOMEscan technology performed by DiscoveRx Corporation, Sa...
Ligand InfoPC cidPC sid
In DepthDetails US Patent
TargetPhosphatidylinositol 4-phosphate 3-kinase C2 domain-containing subunit beta(Homo sapiens (Human))
Janssen Pharmaceutica
US Patent
LigandPNGBDBM288349(US10087187, Compound 39)
Affinity DataKd:  1.10nM. Assay description: Kinase enzyme binding affinities of compounds disclosed herein were determined using the KINOMEscan technology performed by DiscoveRx Corporation, Sa...
Ligand InfoPC cidPC sid
In DepthDetails US Patent
TargetSerine/threonine-protein kinase mTOR(Homo sapiens (Human))
Janssen Pharmaceutica
US Patent
LigandPNGBDBM288349(US10087187, Compound 39)
Affinity DataKd:  4.90E+3nM. Assay description: Kinase enzyme binding affinities of compounds disclosed herein were determined using the KINOMEscan technology performed by DiscoveRx Corporation, Sa...
Ligand InfoPC cidPC sid
In DepthDetails US Patent
TargetPhosphatidylinositol 4,5-bisphosphate 3-kinase catalytic subunit gamma isoform(Homo sapiens (Human))
Janssen Pharmaceutica
US Patent
LigandPNGBDBM288349(US10087187, Compound 39)
Affinity DataKd:  8.51E+3nM. Assay description: Kinase enzyme binding affinities of compounds disclosed herein were determined using the KINOMEscan technology performed by DiscoveRx Corporation, Sa...
Ligand InfoPC cidPC sid
In DepthDetails US Patent
TargetPhosphatidylinositol 4,5-bisphosphate 3-kinase catalytic subunit delta isoform(Homo sapiens (Human))
Janssen Pharmaceutica
US Patent
LigandPNGBDBM288349(US10087187, Compound 39)
Affinity DataKd:  31nM. Assay description: Kinase enzyme binding affinities of compounds disclosed herein were determined using the KINOMEscan technology performed by DiscoveRx Corporation, Sa...
Ligand InfoPC cidPC sid
In DepthDetails US Patent