BDBM288357 US10087187, Compound 48
SMILES Cc1nc2c(N)cc(nn2c1Nc1cccc(c1CN1CC(C1)S(C)(=O)=O)C(F)(F)F)N1CCOCC1
InChI Key InChIKey=HFVGWCIRRSMECO-UHFFFAOYSA-N
Data  5 Kd
  Tab Delimited (TSV)   2D SDfile   Computed 3D by Vconf -m prep SDfile
Find this compound or compounds like it in BindingDB:
Activity Spreadsheet -- Enzyme Inhibition Constant Data from BindingDB
Found 5 hits for monomerid = 288357
TargetPhosphatidylinositol 4-phosphate 3-kinase C2 domain-containing subunit alpha(Homo sapiens (Human))
Janssen Pharmaceutica
US Patent
LigandPNGBDBM288357(US10087187, Compound 48)
Affinity DataKd:  2.75E+3nM. Assay description: Kinase enzyme binding affinities of compounds disclosed herein were determined using the KINOMEscan technology performed by DiscoveRx Corporation, Sa...
Ligand InfoPC cidPC sid
In DepthDetails US Patent
TargetPhosphatidylinositol 4-phosphate 3-kinase C2 domain-containing subunit beta(Homo sapiens (Human))
Janssen Pharmaceutica
US Patent
LigandPNGBDBM288357(US10087187, Compound 48)
Affinity DataKd:  1.70nM. Assay description: Kinase enzyme binding affinities of compounds disclosed herein were determined using the KINOMEscan technology performed by DiscoveRx Corporation, Sa...
Ligand InfoPC cidPC sid
In DepthDetails US Patent
TargetSerine/threonine-protein kinase mTOR(Homo sapiens (Human))
Janssen Pharmaceutica
US Patent
LigandPNGBDBM288357(US10087187, Compound 48)
Affinity DataKd: >3.02E+4nM. Assay description: Kinase enzyme binding affinities of compounds disclosed herein were determined using the KINOMEscan technology performed by DiscoveRx Corporation, Sa...
Ligand InfoPC cidPC sid
In DepthDetails US Patent
TargetPhosphatidylinositol 4,5-bisphosphate 3-kinase catalytic subunit gamma isoform(Homo sapiens (Human))
Janssen Pharmaceutica
US Patent
LigandPNGBDBM288357(US10087187, Compound 48)
Affinity DataKd:  6.17E+3nM. Assay description: Kinase enzyme binding affinities of compounds disclosed herein were determined using the KINOMEscan technology performed by DiscoveRx Corporation, Sa...
Ligand InfoPC cidPC sid
In DepthDetails US Patent
TargetPhosphatidylinositol 4,5-bisphosphate 3-kinase catalytic subunit delta isoform(Homo sapiens (Human))
Janssen Pharmaceutica
US Patent
LigandPNGBDBM288357(US10087187, Compound 48)
Affinity DataKd:  34nM. Assay description: Kinase enzyme binding affinities of compounds disclosed herein were determined using the KINOMEscan technology performed by DiscoveRx Corporation, Sa...
Ligand InfoPC cidPC sid
In DepthDetails US Patent