BDBM288387 US10087187, Compound 82
SMILES CC(C)C(N)C(=O)OCc1nc2c(N)cc(nn2c1Nc1cccc(c1C)C(F)(F)F)N1CCOCC1
InChI Key InChIKey=YAFDJBJFXQXWAD-UHFFFAOYSA-N
Data  5 Kd
  Tab Delimited (TSV)   2D SDfile   Computed 3D by Vconf -m prep SDfile
Find this compound or compounds like it in BindingDB:
Activity Spreadsheet -- Enzyme Inhibition Constant Data from BindingDB
Found 5 hits for monomerid = 288387
TargetPhosphatidylinositol 4-phosphate 3-kinase C2 domain-containing subunit alpha(Homo sapiens (Human))
Janssen Pharmaceutica
US Patent
LigandPNGBDBM288387(US10087187, Compound 82)
Affinity DataKd:  3.24E+4nM. Assay description: Kinase enzyme binding affinities of compounds disclosed herein were determined using the KINOMEscan technology performed by DiscoveRx Corporation, Sa...
Ligand InfoKEGGPC cidPC sid
In DepthDetails US Patent
TargetPhosphatidylinositol 4-phosphate 3-kinase C2 domain-containing subunit beta(Homo sapiens (Human))
Janssen Pharmaceutica
US Patent
LigandPNGBDBM288387(US10087187, Compound 82)
Affinity DataKd:  1.30nM. Assay description: Kinase enzyme binding affinities of compounds disclosed herein were determined using the KINOMEscan technology performed by DiscoveRx Corporation, Sa...
Ligand InfoKEGGPC cidPC sid
In DepthDetails US Patent
TargetSerine/threonine-protein kinase mTOR(Homo sapiens (Human))
Janssen Pharmaceutica
US Patent
LigandPNGBDBM288387(US10087187, Compound 82)
Affinity DataKd:  2.51E+4nM. Assay description: Kinase enzyme binding affinities of compounds disclosed herein were determined using the KINOMEscan technology performed by DiscoveRx Corporation, Sa...
Ligand InfoKEGGPC cidPC sid
In DepthDetails US Patent
TargetPhosphatidylinositol 4,5-bisphosphate 3-kinase catalytic subunit gamma isoform(Homo sapiens (Human))
Janssen Pharmaceutica
US Patent
LigandPNGBDBM288387(US10087187, Compound 82)
Affinity DataKd: >3.02E+4nM. Assay description: Kinase enzyme binding affinities of compounds disclosed herein were determined using the KINOMEscan technology performed by DiscoveRx Corporation, Sa...
Ligand InfoKEGGPC cidPC sid
In DepthDetails US Patent
TargetPhosphatidylinositol 4,5-bisphosphate 3-kinase catalytic subunit delta isoform(Homo sapiens (Human))
Janssen Pharmaceutica
US Patent
LigandPNGBDBM288387(US10087187, Compound 82)
Affinity DataKd:  263nM. Assay description: Kinase enzyme binding affinities of compounds disclosed herein were determined using the KINOMEscan technology performed by DiscoveRx Corporation, Sa...
Ligand InfoKEGGPC cidPC sid
In DepthDetails US Patent