BDBM29017 (1S,5S,7R)-N-hydroxy-3-[(4-phenylphenyl)methyl]-6,8-dioxa-3-azabicyclo[3.2.1]octane-7-carboxamide::3-azadioxabicyclooctane derivative, 12
SMILES ONC(=O)[C@@H]1O[C@H]2CN(Cc3ccc(cc3)-c3ccccc3)C[C@@H]1O2
InChI Key InChIKey=CFRKRBAYOCWWDQ-OKZBNKHCSA-N
Data  1 IC50  1 Kd
  Tab Delimited (TSV)   2D SDfile   Computed 3D by Vconf -m prep SDfile
Find this compound or compounds like it in BindingDB:
Activity Spreadsheet -- Enzyme Inhibition Constant Data from BindingDB
Found 1 hit for monomerid = 29017
TargetMacrophage metalloelastase(Homo sapiens (Human))
University of Florence
LigandPNGBDBM29017((1S,5S,7R)-N-hydroxy-3-[(4-phenylphenyl)methyl]-6,...)
Affinity DataIC50:  3.99E+5nM Kd: >5.00E+5nMpH: 7.0 T: 2°C. Assay description: The NMR experiments were performed to determine the binding affinity (KD) for the MMP-12 catalytic domain. The alteration of the chemical shifts indu...
In DepthDetails ArticlePubMed