BDBM298288 US10123984, Example 2H::US10744104, Example 2H::US11547687, Example 2H::US20230285340, Example 2H
SMILES CC(C)COC(=O)C(=O)N[C@@H](C[C@@H](O)C(O)=O)Cc1ccc(cc1)-c1cccc(Cl)c1
InChI Key InChIKey=WMJSCKJINQKESR-WOJBJXKFSA-N
Data  4 KI
  Tab Delimited (TSV)   2D SDfile   Computed 3D by Vconf -m prep SDfile
Find this compound or compounds like it in BindingDB:
Activity Spreadsheet -- Enzyme Inhibition Constant Data from BindingDB
Found 4 hits for monomerid = 298288
TargetNeprilysin(Homo sapiens (Human))
Theravance Biopharma R&D Ip
US Patent
LigandPNGBDBM298288(US10123984, Example 2H | US10744104, Example 2H | ...)
Affinity DataKi: <1nM. Assay description: The assays were performed in 384-well white opaque plates at 37° C. using the fluorogenic peptide substrates at a concentration of 10 μM in Assa...
Ligand InfoKEGGPC cidPC sid
In DepthDetails US Patent
TargetNeprilysin/Angiotensin-converting enzyme(Homo sapiens (Human))
Theravance Biopharma R&D Ip
US Patent
LigandPNGBDBM298288(US10123984, Example 2H | US10744104, Example 2H | ...)
Affinity DataKi: <1nM. Assay description: Recombinant human NEP and recombinant human ACE were obtained commercially (R&D Systems, Minneapolis, Minn., catalog numbers 1182-ZN and 929-ZN, resp...
Ligand InfoKEGGPC cidPC sid
In DepthDetails US Patent
TargetNeprilysin/Angiotensin-converting enzyme(Homo sapiens (Human))
Theravance Biopharma R&D Ip
US Patent
LigandPNGBDBM298288(US10123984, Example 2H | US10744104, Example 2H | ...)
Affinity DataKi: <1nM. Assay description: The assays were performed in 384-well white opaque plates at 37? C. using the fluorogenic peptide substrates at a concentration of 10 μM in Assa...
Ligand InfoKEGGPC cidPC sid
In DepthDetails US Patent
TargetNeprilysin(Homo sapiens (Human))
Theravance Biopharma R&D Ip
US Patent
LigandPNGBDBM298288(US10123984, Example 2H | US10744104, Example 2H | ...)
Affinity DataKi: <1nM. Assay description: The assays were performed in 384-well white opaque plates at 37° C. using the fluorogenic peptide substrates at a concentration of 10 μM in Assa...
Ligand InfoKEGGPC cidPC sid
In DepthDetails US Patent