BDBM299862 6-[4-(5-amino-6- carbamoylpyridin- 2-yl)piperidin-1- yl]-2-[(1- cyanocyclopropyl) methoxy]-N- methyl-N-(propan- 2-yl)pyrimidine-4- carboxamide::US9593097, Example 232
SMILES CC(C)N(C)C(=O)c1cc(nc(OCC2(CC2)C#N)n1)N1CCC(CC1)c1ccc(N)c(n1)C(N)=O
InChI Key InChIKey=PZTRNNUJTCURBZ-UHFFFAOYSA-N
Data  1 KI
  Tab Delimited (TSV)   2D SDfile   Computed 3D by Vconf -m prep SDfile
Find this compound or compounds like it in BindingDB:
Activity Spreadsheet -- Enzyme Inhibition Constant Data from BindingDB
Found 1 hit for monomerid = 299862
TargetTyrosine-protein kinase receptor UFO(Homo sapiens (Human))
Pfizer
US Patent
LigandPNGBDBM299862(6-[4-(5-amino-6- carbamoylpyridin- 2-yl)piperidin-...)
Affinity DataKi:  52.7nM. Assay description: AXL enzyme inhibition (% inhibition, Kiapp and Ki values) by small molecule inhibitors was evaluated using a fluorescence-based microfluidic mobility...
Ligand InfoPC cidPC sid
In DepthDetails US Patent