BDBM300283 US9593110, 21-1
SMILES CCc1cc(on1)C(=O)N[C@@H](C[C@@H](CN)C(O)=O)Cc1ccc(cc1)-c1cc(Cl)ccc1F
InChI Key InChIKey=DAVPYHSEGTZBTG-QFBILLFUSA-N
Data  1 KI
  Tab Delimited (TSV)   2D SDfile   Computed 3D by Vconf -m prep SDfile
Find this compound or compounds like it in BindingDB:
Activity Spreadsheet -- Enzyme Inhibition Constant Data from BindingDB
Found 1 hit for monomerid = 300283
TargetNeprilysin(Homo sapiens (Human))
Theravence Biopharma R&D Ip
US Patent
LigandPNGBDBM300283(US9593110, 21-1)
Affinity DataKi: <1nM. Assay description: Recombinant human NEP and recombinant human ACE were obtained commercially (R&D Systems, Minneapolis, Minn., catalog numbers 1182-ZN and 929-ZN, resp...
Ligand InfoPC cidPC sid
In DepthDetails US Patent