BDBM30287 indole-based 6-membered lactam, 22
SMILES O=C(Nc1nccs1)c1ccc2cc3C(=O)NCCn3c2c1
InChI Key InChIKey=RWBKCLCZIDTJJQ-UHFFFAOYSA-N
Data  1 IC50
  Tab Delimited (TSV)   2D SDfile   Computed 3D by Vconf -m prep SDfile
Find this compound or compounds like it in BindingDB:
Activity Spreadsheet -- Enzyme Inhibition Constant Data from BindingDB
Found 1 hit for monomerid = 30287
TargetMAP kinase-activated protein kinase 2 [41-364](Homo sapiens (Human))
Boehringer Ingelheim Pharmaceuticals
LigandPNGBDBM30287(indole-based 6-membered lactam, 22)
Affinity DataIC50:  1.10E+3nMpH: 7.6 T: 2°C. Assay description: Diluted compounds and activated GST-MK2 were incubated in neutravidin coated plates (Pierce) in reaction buffer containing biotinylated GST-LSP1 and ...
In DepthDetails ArticlePubMed