BDBM30295 indole-based 6-membered lactam, 4i
SMILES CC(C)NCC1Cn2c(cc3ccc(cc23)C(=O)Nc2nccs2)C(=O)N1
InChI Key InChIKey=CEDLSFPRHQTGPW-UHFFFAOYSA-N
Data  1 IC50
  Tab Delimited (TSV)   2D SDfile   Computed 3D by Vconf -m prep SDfile
Find this compound or compounds like it in BindingDB:
Activity Spreadsheet -- Enzyme Inhibition Constant Data from BindingDB
Found 1 hit for monomerid = 30295
TargetMAP kinase-activated protein kinase 2 [41-364](Homo sapiens (Human))
Boehringer Ingelheim Pharmaceuticals
LigandPNGBDBM30295(indole-based 6-membered lactam, 4i)
Affinity DataIC50: >1.00E+4nMpH: 7.6 T: 2°C. Assay description: Diluted compounds and activated GST-MK2 were incubated in neutravidin coated plates (Pierce) in reaction buffer containing biotinylated GST-LSP1 and ...
In DepthDetails ArticlePubMed