BDBM30301 indole-based 7-membered lactam, 25d
SMILES CC1CNC(=O)c2cc3ccc(cc3n2C1)C(=O)Nc1cccnc1
InChI Key InChIKey=PPKZBHWXZJUOKQ-UHFFFAOYSA-N
Data  1 IC50
  Tab Delimited (TSV)   2D SDfile   Computed 3D by Vconf -m prep SDfile
Find this compound or compounds like it in BindingDB:
Activity Spreadsheet -- Enzyme Inhibition Constant Data from BindingDB
Found 1 hit for monomerid = 30301
TargetMAP kinase-activated protein kinase 2 [41-364](Homo sapiens (Human))
Boehringer Ingelheim Pharmaceuticals
LigandPNGBDBM30301(indole-based 7-membered lactam, 25d)
Affinity DataIC50:  320nM. Assay description: Diluted compounds and activated GST-MK2 were incubated in neutravidin coated plates (Pierce) in reaction buffer containing biotinylated GST-LSP1 and ...
In DepthDetails ArticlePubMed