BDBM30303 indole-based 7-membered lactam, 25c
SMILES OCC1CNC(=O)c2cc3ccc(cc3n2C1)C(=O)Nc1nccs1
InChI Key InChIKey=QJSZJOPFVZPEGX-UHFFFAOYSA-N
Data  1 IC50
  Tab Delimited (TSV)   2D SDfile   Computed 3D by Vconf -m prep SDfile
Find this compound or compounds like it in BindingDB:
Activity Spreadsheet -- Enzyme Inhibition Constant Data from BindingDB
Found 1 hit for monomerid = 30303
TargetMAP kinase-activated protein kinase 2 [41-364](Homo sapiens (Human))
Boehringer Ingelheim Pharmaceuticals
LigandPNGBDBM30303(indole-based 7-membered lactam, 25c)
Affinity DataIC50:  52nM. Assay description: Diluted compounds and activated GST-MK2 were incubated in neutravidin coated plates (Pierce) in reaction buffer containing biotinylated GST-LSP1 and ...
In DepthDetails ArticlePubMed