BDBM30428 Racemic::pyridazinone derivative, 8g
SMILES CCC(Oc1ccc2N=C(NS(=O)(=O)c2c1)c1c(O)c(nn(CCC(C)C)c1=O)-c1cccs1)C(N)=O
InChI Key InChIKey=DDKWEVPYJSKSCI-UHFFFAOYSA-N
Data  1 IC50  1 EC50
  Tab Delimited (TSV)   2D SDfile   Computed 3D by Vconf -m prep SDfile
Find this compound or compounds like it in BindingDB:
Activity Spreadsheet -- Enzyme Inhibition Constant Data from BindingDB
Found 1 hit for monomerid = 30428
TargetGenome polyprotein(Hepatitis C virus genotype 1b (isolate BK) (HCV))
Anadys Pharmaceuticals
LigandPNGBDBM30428(Racemic | pyridazinone derivative, 8g)
Affinity DataIC50:  1.55E+3nM EC50:  7.60E+3nMpH: 7.5 T: 2°C. Assay description: Assays were performed in a 96-well streptavidin-coated Flash-Plate using enzyme, RNA substrate, and [alpha-33P]GTP/GTP with inhibitor concentration v...
In DepthDetails ArticlePubMed