BDBM30432 Racemic::pyridazinone derivative, 8k
SMILES CCOC(=O)C(C)Oc1ccc2N=C(NS(=O)(=O)c2c1)c1c(O)c(nn(CCC(C)C)c1=O)-c1cccs1
InChI Key InChIKey=MMGONUHDKHYILM-UHFFFAOYSA-N
Data  1 IC50  1 EC50
  Tab Delimited (TSV)   2D SDfile   Computed 3D by Vconf -m prep SDfile
Find this compound or compounds like it in BindingDB:
Activity Spreadsheet -- Enzyme Inhibition Constant Data from BindingDB
Found 1 hit for monomerid = 30432
TargetGenome polyprotein(Hepatitis C virus genotype 1b (isolate BK) (HCV))
Anadys Pharmaceuticals
LigandPNGBDBM30432(Racemic | pyridazinone derivative, 8k)
Affinity DataIC50:  6.30E+3nM EC50: >1.00E+4nMpH: 7.5 T: 2°C. Assay description: Assays were performed in a 96-well streptavidin-coated Flash-Plate using enzyme, RNA substrate, and [alpha-33P]GTP/GTP with inhibitor concentration v...
In DepthDetails ArticlePubMed