BDBM30436 pyridazinone derivative, 8o
SMILES CC(C)CCn1nc(-c2cccs2)c(O)c(C2=Nc3ccc(C=CC(N)=O)cc3S(=O)(=O)N2)c1=O
InChI Key InChIKey=RGCHCVGSLKVFLI-UHFFFAOYSA-N
Data  1 IC50
  Tab Delimited (TSV)   2D SDfile   Computed 3D by Vconf -m prep SDfile
Find this compound or compounds like it in BindingDB:
Activity Spreadsheet -- Enzyme Inhibition Constant Data from BindingDB
Found 1 hit for monomerid = 30436
TargetGenome polyprotein(Hepatitis C virus genotype 1b (isolate BK) (HCV))
Anadys Pharmaceuticals
LigandPNGBDBM30436(pyridazinone derivative, 8o)
Affinity DataIC50:  230nMpH: 7.5 T: 2°C. Assay description: Assays were performed in a 96-well streptavidin-coated Flash-Plate using enzyme, RNA substrate, and [alpha-33P]GTP/GTP with inhibitor concentration v...
In DepthDetails ArticlePubMed