BDBM311134 US10155751, Example 21
SMILES C[C@@H](Oc1cc(cc2nn(C)c(C)c12)-c1cnn(c1)C1CCC1)[C@H]1CNC(=O)C1
InChI Key InChIKey=QEXLPJJNYWTGID-GDBMZVCRSA-N
Data  3 IC50
  Tab Delimited (TSV)   2D SDfile   Computed 3D by Vconf -m prep SDfile
Find this compound or compounds like it in BindingDB:
Activity Spreadsheet -- Enzyme Inhibition Constant Data from BindingDB
Found 3 hits for monomerid = 311134
TargetTyrosine-protein kinase SYK [342-635](Homo sapiens (Human))
Boehringer Ingelheim International
US Patent
LigandPNGBDBM311134(US10155751, Example 21)
Affinity DataIC50:  1.20nM. Assay description: Recombinant human SYK (amino acids 342-635) was expressed as a fusion protein with an N-terminal GST tag. The test compounds were dissolved in 100% D...
Ligand InfoPC cidPC sid
In DepthDetails US Patent
TargetReceptor-type tyrosine-protein kinase FLT3 [564-960](Homo sapiens (Human))
Boehringer Ingelheim International
US Patent
LigandPNGBDBM311134(US10155751, Example 21)
Affinity DataIC50:  2.21E+3nM. Assay description: Recombinant human FLT3 (amino acids 564-958, Molecular weight 48.6 kDa, Invitrogen #PR4666C) was expressed with an Histidine tag. The test compounds...
Ligand InfoPC cidPC sid
In DepthDetails US Patent
TargetAurora kinase B [1-341](Homo sapiens (Human))
Boehringer Ingelheim International
US Patent
LigandPNGBDBM311134(US10155751, Example 21)
Affinity DataIC50:  1.73E+4nM. Assay description: Recombinant human Aurora B (amino acids 1-344, clone number DU1773, Molecular weight 40.2 kDa, University of Dundee) was expressed as a fusion protei...
Ligand InfoPC cidPC sid
In DepthDetails US Patent