BDBM312136 4-bromo-6-hydroxy-2-(4-hydroxyphenyl)-1-oxo-1,2-dihydroisoquinoline-8-carbonitrile ::US9604931, 14k::US9623021, Compound 14l
SMILES Oc1ccc(cc1)-n1cc(Br)c2cc(O)cc(C#N)c2c1=O
InChI Key InChIKey=IYKXSJBWAQMFEC-UHFFFAOYSA-N
Data  4 KI
  Tab Delimited (TSV)   2D SDfile   Computed 3D by Vconf -m prep SDfile
Find this compound or compounds like it in BindingDB:
Activity Spreadsheet -- Enzyme Inhibition Constant Data from BindingDB
Found 4 hits for monomerid = 312136
TargetEstrogen receptor beta(Homo sapiens (Human))
Gtx
US Patent
LigandPNGBDBM312136(4-bromo-6-hydroxy-2-(4-hydroxyphenyl)-1-oxo-1,2-di...)
Affinity DataKi:  6nM. Assay description: Recombinant ER-α or ER-β ligand binding domain (LBD) was combined with [3H]E2 (PerkinElmer, Waltham, Mass.) in buffer A (10 mM Tris, pH 7.4...
Ligand InfoPC cidPC sid
In DepthDetails US Patent
TargetSteroid hormone receptor ERR2(Homo sapiens (Human))
Gtx
US Patent
LigandPNGBDBM312136(4-bromo-6-hydroxy-2-(4-hydroxyphenyl)-1-oxo-1,2-di...)
Affinity DataKi:  46nM. Assay description: Estrogen receptor (ERβ) binding affinity of the NRBAs was also determined using an in vitro competitive radioligand-binding assay with [3H]-estr...
Ligand InfoPC cidPC sid
In DepthDetails US Patent
TargetEstrogen receptor(Homo sapiens (Human))
Gtx
US Patent
LigandPNGBDBM312136(4-bromo-6-hydroxy-2-(4-hydroxyphenyl)-1-oxo-1,2-di...)
Affinity DataKi:  76nM. Assay description: Recombinant ER-α or ER-β ligand binding domain (LBD) was combined with [3H]E2 (PerkinElmer, Waltham, Mass.) in buffer A (10 mM Tris, pH 7.4...
Ligand InfoPC cidPC sid
In DepthDetails US Patent
TargetSteroid hormone receptor ERR1(Homo sapiens (Human))
Gtx
US Patent
LigandPNGBDBM312136(4-bromo-6-hydroxy-2-(4-hydroxyphenyl)-1-oxo-1,2-di...)
Affinity DataKi: >394nM. Assay description: Estrogen receptor (ERβ) binding affinity of the NRBAs was also determined using an in vitro competitive radioligand-binding assay with [3H]-estr...
Ligand InfoPC cidPC sid
In DepthDetails US Patent