BDBM312356 2-[3-(3-Cyclopropyl-[1,2,4]oxadiazol-5-yl)-4,4-dimethyl-4,5,6,7-tetrahydro-benzo[b]thiophen-2-ylcarbamoyl]-cyclopent-1-enecarboxylic acid::US9604977, Example 102
SMILES CC1(C)CCCc2sc(NC(=O)C3=C(CCC3)C(O)=O)c(-c3nc(no3)C3CC3)c12
InChI Key InChIKey=ZHZCWRFJNGDRJR-UHFFFAOYSA-N
Data  2 IC50
  Tab Delimited (TSV)   2D SDfile   Computed 3D by Vconf -m prep SDfile
Find this compound or compounds like it in BindingDB:
Activity Spreadsheet -- Enzyme Inhibition Constant Data from BindingDB
Found 2 hits for monomerid = 312356
TargetFatty acid-binding protein 5(Homo sapiens (Human))
Hoffmann-La Roche
US Patent
LigandPNGBDBM312356(2-[3-(3-Cyclopropyl-[1,2,4]oxadiazol-5-yl)-4,4-dim...)
Affinity DataIC50:  10nM. Assay description: Compounds were profiled for activity against human FABP4 (huFABP4) and/or human FABP5 (huFABP5) in Terbium (Tb) time resolved-fluorescence energy tra...
Ligand InfoPC cidPC sid
In DepthDetails US Patent
TargetFatty acid-binding protein, adipocyte(Homo sapiens (Human))
Hoffmann-La Roche
US Patent
LigandPNGBDBM312356(2-[3-(3-Cyclopropyl-[1,2,4]oxadiazol-5-yl)-4,4-dim...)
Affinity DataIC50:  50nM. Assay description: Compounds were profiled for activity against human FABP4 (huFABP4) and/or human FABP5 (huFABP5) in Terbium (Tb) time resolved-fluorescence energy tra...
Ligand InfoPC cidPC sid
In DepthDetails US Patent