BDBM312420 2-[3-(3-Cyclopropyl-[1,2,4]oxadiazol-5-yl)-6-ethyl-4,5,6,7-tetrahydro-benzo[b]thiophen-2-ylcarbamoyl]-cyclopent-1-enecarboxylic acid::US9604977, Example 166
SMILES CCC1CCc2c(C1)sc(NC(=O)C1=C(CCC1)C(O)=O)c2-c1nc(no1)C1CC1
InChI Key InChIKey=OIEHMZJAYLAGAA-UHFFFAOYSA-N
Data  2 IC50
  Tab Delimited (TSV)   2D SDfile   Computed 3D by Vconf -m prep SDfile
Find this compound or compounds like it in BindingDB:
Activity Spreadsheet -- Enzyme Inhibition Constant Data from BindingDB
Found 2 hits for monomerid = 312420
TargetFatty acid-binding protein 5(Homo sapiens (Human))
Hoffmann-La Roche
US Patent
LigandPNGBDBM312420(2-[3-(3-Cyclopropyl-[1,2,4]oxadiazol-5-yl)-6-ethyl...)
Affinity DataIC50:  13nM. Assay description: Compounds were profiled for activity against human FABP4 (huFABP4) and/or human FABP5 (huFABP5) in Terbium (Tb) time resolved-fluorescence energy tra...
Ligand InfoPC cidPC sid
In DepthDetails US Patent
TargetFatty acid-binding protein, adipocyte(Homo sapiens (Human))
Hoffmann-La Roche
US Patent
LigandPNGBDBM312420(2-[3-(3-Cyclopropyl-[1,2,4]oxadiazol-5-yl)-6-ethyl...)
Affinity DataIC50:  24nM. Assay description: Compounds were profiled for activity against human FABP4 (huFABP4) and/or human FABP5 (huFABP5) in Terbium (Tb) time resolved-fluorescence energy tra...
Ligand InfoPC cidPC sid
In DepthDetails US Patent