BDBM31651 tetrahydrobenzothiophene (THBT), 18
SMILES Cc1cccc(C)c1C(=O)C1CCCc2sc(NC(=O)c3ccccc3[N+]([O-])=O)c(C(N)=O)c12
InChI Key InChIKey=UVBIDCXWPPYKMW-UHFFFAOYSA-N
Data  2 IC50
  Tab Delimited (TSV)   2D SDfile   Computed 3D by Vconf -m prep SDfile
Find this compound or compounds like it in BindingDB:
Activity Spreadsheet -- Enzyme Inhibition Constant Data from BindingDB
Found 2 hits for monomerid = 31651
LigandPNGBDBM31651(tetrahydrobenzothiophene (THBT), 18)
Affinity DataIC50:  5.01E+3nMpH: 7.5 T: 2°C. Assay description: Inhibition of PDE4 is measured using a luminescence-coupled assay system developed by Cambrex. This assay system couples the formation of AMP, derive...
In DepthDetails ArticlePubMed
LigandPNGBDBM31651(tetrahydrobenzothiophene (THBT), 18)
Affinity DataIC50:  2.51E+3nMpH: 7.5 T: 2°C. Assay description: Inhibition of PDE4 is measured using a luminescence-coupled assay system developed by Cambrex. This assay system couples the formation of AMP, derive...
In DepthDetails ArticlePubMed