BDBM321273 N-[3-(benzylmethylamino)propyl]-4-bromobenzamide::US10179761, Compound 3.1.22
SMILES CN(CCCNC(=O)c1ccc(Br)cc1)Cc1ccccc1
InChI Key InChIKey=WWEAHUHMEHELLH-UHFFFAOYSA-N
Data  4 KI
  Tab Delimited (TSV)   2D SDfile   Computed 3D by Vconf -m prep SDfile
Find this compound or compounds like it in BindingDB:
Activity Spreadsheet -- Enzyme Inhibition Constant Data from BindingDB
Found 2 hits for monomerid = 321273
TargetSigma non-opioid intracellular receptor 1(Homo sapiens (Human))
Universities Of Lille
Curated by ChEMBL
LigandPNGBDBM321273(N-[3-(benzylmethylamino)propyl]-4-bromobenzamide |...)
Affinity DataKi:  2.10nM. Assay description: Displacement of [3H](+)-pentazocine from S1R in human Jurkat cell membranes after 2 hrs by liquid scintillation counting
In DepthDetails ArticlePubMed
TargetSigma intracellular receptor 2(Homo sapiens (Human))
Universities Of Lille
Curated by ChEMBL
LigandPNGBDBM321273(N-[3-(benzylmethylamino)propyl]-4-bromobenzamide |...)
Affinity DataKi:  160nM. Assay description: Displacement of [3H]-DTG from S2R in human Jurkat cell membranes after 1 hr in presence of (+)-pentazocine by liquid scintillation counting
In DepthDetails ArticlePubMed