BDBM321334 3-{[(1R)-1,2,3,4-tetrahydronaphthalen-1-yl- methyl]-amino}pyridine-4-carboxylic acid::US10179769, Example 48::US10807956, Example 48::US11214542, Example 48::US11639333, Example 48
SMILES OC(=O)c1ccncc1NC[C@@H]1CCCc2ccccc12
InChI Key InChIKey=DGPKTIKFLWFZTL-ZDUSSCGKSA-N
Data  7 IC50
  Tab Delimited (TSV)   2D SDfile   Computed 3D by Vconf -m prep SDfile
Find this compound or compounds like it in BindingDB:
Activity Spreadsheet -- Enzyme Inhibition Constant Data from BindingDB
Found 7 hits for monomerid = 321334
TargetLysine-specific demethylase 5A(Homo sapiens (Human))
Celgene Quanticel Research
US Patent
LigandPNGBDBM321334(3-{[(1R)-1,2,3,4-tetrahydronaphthalen-1-yl- methyl...)
Affinity DataIC50:  550nM. Assay description: The enzymatic assay of Jarid1A activity is based upon Time Resolved-Fluorescence Resonance Energy Transfer (TR-FRET) detection. The ability of test c...
Ligand InfoPC cidPC sid
In DepthDetails US Patent
TargetLysine-specific demethylase 5B(Homo sapiens (Human))
Celgene Quanticel Research
US Patent
LigandPNGBDBM321334(3-{[(1R)-1,2,3,4-tetrahydronaphthalen-1-yl- methyl...)
Affinity DataIC50:  550nM. Assay description: The ability of test compounds to inhibit the activity of Jarid1B was determined in 384 well plate format under the following reaction conditions: 0.8...
Ligand InfoPC cidPC sid
In DepthDetails US Patent
TargetLysine-specific demethylase 5B(Homo sapiens (Human))
Celgene Quanticel Research
US Patent
LigandPNGBDBM321334(3-{[(1R)-1,2,3,4-tetrahydronaphthalen-1-yl- methyl...)
Affinity DataIC50:  550nM. Assay description: The ability of test compounds to inhibit the activity of JMJD2C was determined in 384-well plate format under the following reaction conditions: 0.3 ...
Ligand InfoPC cidPC sid
In DepthDetails US Patent
TargetLysine-specific demethylase 4C(Homo sapiens (Human))
Celgene Quanticel Research
US Patent
LigandPNGBDBM321334(3-{[(1R)-1,2,3,4-tetrahydronaphthalen-1-yl- methyl...)
Affinity DataIC50:  550nM. Assay description: JMJD2C: The ability of test compounds to inhibit the activity of JMJD2C was determined in 384-well plate format under the following reaction conditio...
Ligand InfoPC cidPC sid
In DepthDetails US Patent
TargetLysine-specific demethylase 5A(Homo sapiens (Human))
Celgene Quanticel Research
US Patent
LigandPNGBDBM321334(3-{[(1R)-1,2,3,4-tetrahydronaphthalen-1-yl- methyl...)
Affinity DataIC50:  550nM. Assay description: Jarid1A: The enzymatic assay of Jarid1A activity is based upon Time Resolved-Fluorescence Resonance Energy Transfer (TR-FRET) detection. The ability ...
Ligand InfoPC cidPC sid
In DepthDetails US Patent
TargetLysine-specific demethylase 5B(Homo sapiens (Human))
Celgene Quanticel Research
US Patent
LigandPNGBDBM321334(3-{[(1R)-1,2,3,4-tetrahydronaphthalen-1-yl- methyl...)
Affinity DataIC50:  550nM. Assay description: Jarid1B: The ability of test compounds to inhibit the activity of Jarid1B was determined in 384 well plate format under the following reaction condit...
Ligand InfoPC cidPC sid
In DepthDetails US Patent
TargetLysine-specific demethylase 4C(Homo sapiens (Human))
Celgene Quanticel Research
US Patent
LigandPNGBDBM321334(3-{[(1R)-1,2,3,4-tetrahydronaphthalen-1-yl- methyl...)
Affinity DataIC50:  8nM. Assay description: Inhibition of KDM4C (unknown origin) using biotinylated H3K9me3 peptide and alpha-ketoglutarate as substrate pretreated for 1 hr followed by substrat...
Ligand InfoPC cidPC sid
In DepthDetails ArticlePubMed