BDBM321432 (E)-6-(but-2-en-1-yl)-4-(3-chloro-4-(piperazine-1-carbonyl)phenyl)-2-methyl-1H-pyrrolo[2,3-c]pyridin-7(6H)-one::US10183009, Example 116
SMILES C\C=C\Cn1cc(-c2ccc(C(=O)N3CCNCC3)c(Cl)c2)c2cc(C)[nH]c2c1=O
InChI Key InChIKey=ZGGQBUJHVGCBAB-ONEGZZNKSA-N
Data  1 IC50
  Tab Delimited (TSV)   2D SDfile   Computed 3D by Vconf -m prep SDfile
Find this compound or compounds like it in BindingDB:
Activity Spreadsheet -- Enzyme Inhibition Constant Data from BindingDB
Found 1 hit for monomerid = 321432
TargetBromodomain-containing protein 9 [134-239](Homo sapiens (Human))
Genentech
US Patent
LigandPNGBDBM321432((E)-6-(but-2-en-1-yl)-4-(3-chloro-4-(piperazine-1-...)
Affinity DataIC50:  4nM. Assay description: His/Flag epitope tagged BRD9134-239 was cloned, expressed, and purified to homogeneity. BRD9 binding and inhibition was assessed by monitoring the en...
Ligand InfoPC cidPC sid
In DepthDetails US Patent