BDBM322469 (R)-N-(2,2-dimethylquinuclidin-3-yl)thieno[2,3-c]pyridine-2-carboxamide::US10183938, Compound (R)-222
SMILES CC1(C)[C@H](NC(=O)c2cc3ccncc3s2)C2CCN1CC2
InChI Key InChIKey=HVMMETCXGUDIHG-OAHLLOKOSA-N
Data  1 KI
  Tab Delimited (TSV)   2D SDfile   Computed 3D by Vconf -m prep SDfile
Find this compound or compounds like it in BindingDB:
Activity Spreadsheet -- Enzyme Inhibition Constant Data from BindingDB
Found 1 hit for monomerid = 322469
TargetNeuronal acetylcholine receptor subunit alpha-7(Homo sapiens (Human))
Axovant Sciences
US Patent
LigandPNGBDBM322469((R)-N-(2,2-dimethylquinuclidin-3-yl)thieno[2,3-c]p...)
Affinity DataKi:  5.40E+3nM. Assay description: The ability of compounds to displace binding of radioactive ligands from human α7 nAChR was determined, as a measure of the affinity of the comp...
Ligand InfoPC cidPC sid
In DepthDetails US Patent