BDBM32441 Benzo[c][2,7]naphthyridine, 33
SMILES COc1ccccc1Nc1cncc(c1)-c1cc2c(cnc3cc(OC)c(OC)cc23)c(N)n1
InChI Key InChIKey=DIFGSTYSTPFHSV-UHFFFAOYSA-N
Data  1 IC50
  Tab Delimited (TSV)   2D SDfile   Computed 3D by Vconf -m prep SDfile
Find this compound or compounds like it in BindingDB:
Activity Spreadsheet -- Enzyme Inhibition Constant Data from BindingDB
Found 1 hit for monomerid = 32441
Target3-phosphoinositide-dependent protein kinase 1 [48-359](Homo sapiens (Human))
Wyeth Research
LigandPNGBDBM32441(Benzo[c][2,7]naphthyridine, 33)
Affinity DataIC50:  74nM. Assay description: A homogeneous in vitro assay based on a LANCE format was first used for high-throughput screening. Those compounds that showed the largest differenti...
In DepthDetails ArticlePubMed