BDBM32556 arylsulfonylpiperazine, 28
SMILES CC(C)(C)c1ccc(cc1)S(=O)(=O)N1CCN(CC1)c1ccccc1C(F)(F)F
InChI Key InChIKey=TYRFFCXDCSRBCY-UHFFFAOYSA-N
Data  2 IC50  1 EC50
  Tab Delimited (TSV)   2D SDfile   Computed 3D by Vconf -m prep SDfile
Find this compound or compounds like it in BindingDB:
Activity Spreadsheet -- Enzyme Inhibition Constant Data from BindingDB
Found 2 hits for monomerid = 32556
Target11-beta-hydroxysteroid dehydrogenase 1(Mus musculus (mouse))
Amgen
LigandPNGBDBM32556(arylsulfonylpiperazine, 28)
Affinity DataIC50:  73nM. Assay description: Enzyme assays were performed using purified recombinant mouse11beta-HSD1. The fractional conversion of cortisone to cortisol was used to determine en...
In DepthDetails ArticlePubMed
LigandPNGBDBM32556(arylsulfonylpiperazine, 28)
Affinity DataIC50:  15nM EC50:  971nMpH: 7.2 T: 2°C. Assay description: Enzyme assays were performed using purified recombinant human 11beta-HSD1. The fractional conversion of cortisone to cortisol was used to determine e...
In DepthDetails ArticlePubMed