BDBM327403 N-{2-[(3-aminobenzyl)thio]-5-chlorophenyl}-4-chloro-2-fluorobenzenesulfonamide::US9663460, Example 210
SMILES Nc1cccc(CSc2ccc(Cl)cc2NS(=O)(=O)c2ccc(Cl)cc2F)c1
InChI Key InChIKey=JLBJYSTUMLVMAS-UHFFFAOYSA-N
Data  1 IC50
  Tab Delimited (TSV)   2D SDfile   Computed 3D by Vconf -m prep SDfile
Find this compound or compounds like it in BindingDB:
Activity Spreadsheet -- Enzyme Inhibition Constant Data from BindingDB
Found 1 hit for monomerid = 327403
TargetC-C chemokine receptor type 2(Homo sapiens (Human))
Allergan
US Patent
LigandPNGBDBM327403(N-{2-[(3-aminobenzyl)thio]-5-chlorophenyl}-4-chlor...)
Affinity DataIC50:  2.82E+3nM. Assay description: HEK-Gqi5 cells stably expressing CCR2 were cultured in (DMEM high glucose, 10% FBS, 1% PSA, 400 μg/ml geneticin and 50 μg/ml hygromycin. Ap...
Ligand InfoPC cidPC sid
In DepthDetails US Patent