BDBM330768 US9725442, Compound I-345
SMILES CC(C)Oc1ccc(cc1)S(=O)(=O)N1C[C@@H](CC1c1cccnc1)n1nc(CC(O)=O)c2ccc(F)cc12
InChI Key InChIKey=DHFBKIONSOEULQ-VGOKPJQXSA-N
Data  1 KI
  Tab Delimited (TSV)   2D SDfile   Computed 3D by Vconf -m prep SDfile
Find this compound or compounds like it in BindingDB:
Activity Spreadsheet -- Enzyme Inhibition Constant Data from BindingDB
Found 1 hit for monomerid = 330768
TargetProstaglandin D2 receptor 2(Homo sapiens (Human))
Shionogi
US Patent
LigandPNGBDBM330768(US9725442, Compound I-345)
Affinity DataKi:  2.51E+3nM. Assay description: Cell membrane was prepared from CRTH2-expressing K562 cell. The cell membrane (20 μg/well) was mixed with reaction buffer (50 mM Tris/HCl, pH 7....
Ligand InfoPC cidPC sid
In DepthDetails US Patent